http://www.cesm.ucar.edu/models/ccsm4.0/tags/ccsm4_0_rel/ccsm4_0_a02/index.html 11 Feb 2011
CCSM4 Software Release              CCSM4 Release Home |  CESM Home

ccsm4_0_a02

Release Notes, Test Results, and Known Problems

Contents


Release Notes

================================================================================
SVN $URL: https://svn-ccsm-release.cgd.ucar.edu/model_versions/ccsm4_0_a02 $
================================================================================

Tag name: ccsm4_0_a02
Originator(s): cseg
Date: Wed Mar 10 2010
One-line Summary: Second ccsm4.0 alpha release tag.

This tag is the second released version of the ccsm4.0 alpha code.
The science is essentially the same, but because of numerous software 
improvements and bug fixes, users are strongly encouraged to upgrade 
from previous versions to this release.

- various minor bug fixes in both scientific and non-scientific code
- improvements to build and run scripts
- additional support for new machines
- improved default processor layouts for certain configurations
- improved parallel i/o library (pio)
- improved performance of high resolution configurations
- new support for omp threading in pop model
- clm Volatile Organic Compounds (VOC) module now implements science from
  MEGAN Heald et. al. 2008 version.
- new cam FV filter options needed for high res runs
- new cam dust tuning mods for trop_bam and trop_mozart configs
- new cam pre-industrial and 20th century transient SST datasets
- new cam atm_aero flag

Release tag ccsm4_0_a02 corresponds to internal release candidate ccsm4_0_rel05.

================================================================================

Tag name: ccsm4_0_a01
Originator(s): cseg
Date: Fri Jan 15 2010
One-line Summary: First ccsm4.0 alpha release tag. 

This tag is the first released of the ccsm4.0 alpha code.
The purpose of alpha code releases is testing leading up to a final release.
Release tag ccsm4_0_a01 corresponds to internal release candidate ccsm4_0_rel03.

Return to Top

Software Engineering Test Record

Bluefire Pre-tag Test Record


Possible test result outcomes:
  UNDEF - undefined result
  SFAIL - scripts case generation failed
  TFAIL - test setup error
  GEN   - case generated
  PEND  - case submitted
  RUN   - case running or died during run, likely failure
  PASS  - case passed
  CHECK - manual review of data is required
  FAIL  - case failed
  BFAIL - compare test couldn't find base result
  ERROR - test checker failed, test may or may not have passed

TestStatusCompare Baseline HistoryCompare Baseline LogsNotes
P4A.f09_g16.B1850CN.bluefire PASS PASS PASS  
SMS_D.f09_g16.B1850CN.bluefire PASS PASS PASS  
SMS_D.f09_g16.B20TRCN.bluefire PASS PASS PASS  
SMS_D.f19_g16.B.bluefire PASS --- BFAIL  
SMS_D.T31_g37.B.bluefire PASS --- BFAIL  
ERI.f09_g16.B1850CN.bluefire PASS --- PASS  
ERI.f09_g16.B20TRCN.bluefire PASS --- PASS  
ERI.f09_g16.B1850RMCN.bluefire PASS --- PASS  
ERT.f09_g16.B1850CN.bluefire PASS PASS PASS  
ERT.f09_g16.B20TRCN.bluefire PASS PASS PASS  
ERT.f09_g16.B1850RMCN.bluefire PASS PASS PASS  
ERI.f19_g16.B.bluefire PASS --- BFAIL  
ERI.T31_g37.B.bluefire PASS --- BFAIL  
ERS.f19_g16.B.bluefire PASS PASS PASS  
ERS_PT.f19_g16.B.bluefire PASS --- BFAIL  
ERS_PT.T31_g37.B.bluefire PASS --- BFAIL  
ERS.f45_g37.BW1850CN.bluefire PASS FAIL FAIL expected pop is not bfb for gx3v7
ERI.f19_g16.BW1850CN.bluefire PASS --- PASS  
PET_PT.T62_g16.C.bluefire PASS --- BFAIL  
PET_PT.T62_g16.D.bluefire PASS --- PASS  
PET_PT.T62_g16.G.bluefire PASS --- BFAIL  
PET_PT.f19_f19.F.bluefire PASS --- PASS  
PET_PT.f19_g16.I.bluefire PASS --- BFAIL  
PET_PT.f19_g16.E.bluefire PASS --- BFAIL  
PET_PT.f19_g16.B1850CN.bluefire TFAIL --- --- test not being threaded
ERS_D.f19_g16.A.bluefire PASS PASS PASS  
ERI.f45_g37.A.bluefire PASS --- PASS  
ERS_D.f19_g16.X.bluefire PASS PASS PASS  
ERI.f19_g16.X.bluefire PASS --- PASS  
ERS_D.f19_f19.F.bluefire PASS PASS PASS  
ERS_PT.f19_f19.F.bluefire PASS PASS PASS  
ERI.f19_f19.FW1850.bluefire PASS --- PASS  
ERI.f19_f19.F.bluefire PASS --- PASS  
ERS.f19_f19.FCN.bluefire PASS PASS PASS  
ERB.f45_g37.I.bluefire PASS --- PASS  
ERB.T62_g16.D.bluefire PASS --- PASS  
ERB.f45_g37.D.bluefire PASS --- PASS  
ERB.f45_g37.G.bluefire PASS --- FAIL expected pop is not bfb for gx3v7
ERB.T62_g16.C.bluefire PASS --- PASS  
ERI.f19_g16.E.bluefire PASS --- PASS  
ERS.f19_g16.E1850CN.bluefire PASS PASS PASS  
ERT.T62_g16.C.bluefire PASS PASS PASS  
ERP.T62_g37.C.bluefire PASS FAIL FAIL expected pop is not bfb for gx3v7
ERP.T62_g37.G.bluefire PASS FAIL FAIL expected pop is not bfb for gx3v7
SMS_D.T62_g16.C.bluefire PASS PASS PASS  


CHECK ERT.f09_g16.B1850CN.bluefire.perf npes=128 tput=4.479 memh=1052.642 memr=-0.001 tag=ccsm4_0_beta45 baseline 
CHECK ERT.f09_g16.B1850CN.bluefire.perf npes=128 tput=4.393 memh=1059.980 memr=-0.001 tag=ccsm4_0_rel05 
  
CHECK ERT.f09_g16.B20TRCN.bluefire.perf npes=128 tput=4.218 memh=1067.760 memr=-0.001 tag=ccsm4_0_beta45 baseline 
CHECK ERT.f09_g16.B20TRCN.bluefire.perf npes=128 tput=4.194 memh=1075.663 memr=-0.001 tag=ccsm4_0_rel05 
  
CHECK ERT.f09_g16.B1850RMCN.bluefire.perf npes=128 tput=4.513 memh=1044.605 memr=-0.001 tag=ccsm4_0_beta45 baseline 
CHECK ERT.f09_g16.B1850RMCN.bluefire.perf npes=128 tput=4.426 memh=1051.823 memr=-0.001 tag=ccsm4_0_rel05 
  
CHECK ERT.T62_g16.C.bluefire.perf npes=128 tput=22.790 memh=905.704 memr=-0.001 tag=ccsm4_0_beta45 baseline 
CHECK ERT.T62_g16.C.bluefire.perf npes=128 tput=21.521 memh=912.973 memr=-0.001 tag=ccsm4_0_rel05 
  

Bluefire Posttag Test Record


Possible test result outcomes:
  UNDEF - undefined result
  SFAIL - scripts case generation failed
  TFAIL - test setup error
  GEN   - case generated
  PEND  - case submitted
  RUN   - case running or died during run, likely failure
  PASS  - case passed
  CHECK - manual review of data is required
  FAIL  - case failed
  BFAIL - compare test couldn't find base result
  ERROR - test checker failed, test may or may not have passed

TestStatusCompare Baseline HistoryCompare Baseline LogsNotes
SMS.f45_g37.B.bluefire PASS --- BFAIL  
SMS.f45_f45.F.bluefire PASS PASS PASS  
ERI.T62_g37.C.bluefire PASS --- FAIL expected pop is not bfb for gx3v7
ERT.T62_g37.C.bluefire PASS FAIL FAIL expected pop is not bfb for gx3v7
ERS.f19_f19.F.bluefire PASS PASS PASS  
ERI.f45_g37.BMOZ.bluefire PASS --- FAIL expected pop is not bfb for gx3v7
ERS.f19_g16.B20TRCNCHM.bluefire PASS PASS PASS  
ERS.f09_g16.B1850CNCHM.bluefire.GC.rel05posttag SFAIL --- ---

CAM build-namelist - ERROR:

invalid value of use_case (1850_cam4_super_fast_llnl) This will be fixed in the next tag.

ERS.f19_f19.F1850.bluefire PASS PASS PASS  
ERS.f45_g37.I4804.bluefire PASS PASS PASS  
SEQ.f19_g16.X.bluefire PASS PASS PASS  
ERS_DE.f19_g16.A.bluefire PASS PASS PASS  
CME.f45_g37.A.bluefire PASS PASS PASS  
CME.f19_g16.X.bluefire PASS PASS PASS  
CME.f19_g16.S.bluefire PASS PASS PASS  
CME.f09_g16.B1850CN.bluefire PASS PASS PASS  
SMS.ne30_f19_g16.F.bluefire PASS PASS PASS  
SMS_RLA.f45_f45.I.bluefire PASS PASS PASS  
SMS_RLB.f45_f45.I.bluefire PASS PASS PASS  
SMS_ROA.f45_f45.I.bluefire PASS PASS PASS  
SMS_ROB.f45_f45.I.bluefire PASS PASS PASS  
PEA_P1.f19_g16.X.bluefire PASS PASS PASS  
PEA_P1.f45_g37.A.bluefire PASS PASS PASS  
PEA_P1.f45_g37.B.bluefire FAIL --- BFAIL cam build failed "models/atm/cam/src/utils/pilgrim/mod_comm.F90", 1516-036 (S) Entity mpi_datatype_null has undefined type. Will be fixed in next tag.
PEM.f19_g16.X.bluefire.cpl PASS --- PASS  
PEM.f45_g37.A.bluefire.cpl PASS --- PASS  
PEM.f19_g16.B.bluefire.cpl PASS --- BFAIL  
PET_PT.f19_g16.X.bluefire PASS --- PASS  
PET_PT.f45_g37.A.bluefire PASS --- PASS  
PET_PT.f09_g16.B1850CN.bluefire PASS --- BFAIL  


CHECK ERT.T62_g37.C.bluefire.perf npes=16 tput=68.690 memh=377.964 memr=-0.001 tag=ccsm4_0_beta45 baseline 
CHECK ERT.T62_g37.C.bluefire.perf npes=16 tput=73.517 memh=376.300 memr=-0.001 tag=ccsm4_0_rel05 
  

Jaguar Pretag Test Record


Possible test result outcomes:
  UNDEF - undefined result
  SFAIL - scripts case generation failed
  TFAIL - test setup error
  GEN   - case generated
  PEND  - case submitted
  RUN   - case running or died during run, likely failure
  PASS  - case passed
  CHECK - manual review of data is required
  FAIL  - case failed
  BFAIL - compare test couldn't find base result
  ERROR - test checker failed, test may or may not have passed

TestStatusCompare Baseline HistoryCompare Baseline LogsNotes
SMS_D.f09_g16.B1850CN.jaguar PASS --- BFAIL lustre problems caused BFAIL
SMS_D.f09_g16.B20TRCN.jaguar PASS --- BFAIL lustre problems caused BFAIL
ERI.f09_g16.B1850CN.jaguar PASS --- BFAIL lustre problems caused BFAIL
ERI.f09_g16.B20TRCN.jaguar PASS --- BFAIL lustre problems caused BFAIL
ERT.f09_g16.B1850CN.jaguar PASS --- BFAIL lustre problems caused BFAIL
ERT.f09_g16.B20TRCN.jaguar PASS --- BFAIL lustre problems caused BFAIL
ERT.f19_g16.B20TR.jaguar PASS --- BFAIL lustre problems caused BFAIL
ERI.f19_g16.B.jaguar PASS --- BFAIL lustre problems caused BFAIL
ERI.T31_g37.B.jaguar PASS --- BFAIL lustre problems caused BFAIL
ERS.f19_g16.X.jaguar PASS --- BFAIL lustre problems caused BFAIL
ERS.f45_g37.A.jaguar PASS --- BFAIL lustre problems caused BFAIL
ERS.f19_f19.F.jaguar PASS --- BFAIL lustre problems caused BFAIL
ERS.f19_f19.FCN.jaguar PASS --- BFAIL lustre problems caused BFAIL
ERT.f19_g16.B.jaguar PASS --- BFAIL lustre problems caused BFAIL
ERT.T31_g37.B.jaguar PASS --- BFAIL lustre problems caused BFAIL
ERS_D.f19_g16.B.jaguar PASS --- BFAIL lustre problems caused BFAIL
ERS_D.T31_g37.B.jaguar PASS --- BFAIL lustre problems caused BFAIL
ERT.T62_g16.C.jaguar PASS --- BFAIL lustre problems caused BFAIL
ERT.T62_g16.D.jaguar PASS --- BFAIL lustre problems caused BFAIL
SMS_D.T62_g16.C.jaguar PASS --- BFAIL lustre problems caused BFAIL


CHECK ERT.f09_g16.B1850CN.jaguar.perf npes=128 tput=3.645 memh=1857.106 memr=1975.914 tag=ccsm4_0_rel05 
 
  
CHECK ERT.f09_g16.B20TRCN.jaguar.perf npes=128 tput=3.215 memh=1875.467 memr=1995.873 tag=ccsm4_0_rel05 
 
  
CHECK ERT.f19_g16.B20TR.jaguar.perf npes=416 tput=16.209 memh=1712.039 memr=1844.814 tag=ccsm4_0_rel05 
 
  
CHECK ERT.f19_g16.B.jaguar.perf npes=416 tput=16.126 memh=1702.947 memr=1835.698 tag=ccsm4_0_rel05 
 
  
CHECK ERT.T31_g37.B.jaguar.perf npes=16 tput=8.274 memh=1368.191 memr=1454.603 tag=ccsm4_0_rel05 
 
  
CHECK ERT.T62_g16.C.jaguar.perf npes=128 tput=etag/run/c memh=etag/run/c memr=etag/run/c tag=ccsm4_0_rel05 
 
  
CHECK ERT.T62_g16.D.jaguar.perf npes=64 tput=28.422 memh=1210.377 memr=1286.580 tag=ccsm4_0_rel05 
 
  

Jaguar Posttag Test Record


Possible test result outcomes:
  UNDEF - undefined result
  SFAIL - scripts case generation failed
  TFAIL - test setup error
  GEN   - case generated
  PEND  - case submitted
  RUN   - case running or died during run, likely failure
  PASS  - case passed
  CHECK - manual review of data is required
  FAIL  - case failed
  BFAIL - compare test couldn't find base result
  ERROR - test checker failed, test may or may not have passed

TestStatusCompare Baseline HistoryCompare Baseline LogsNotes
ERB.T62_g37.C.jaguar PASS --- BFAIL  
ERB.T31_g37.I.jaguar PASS --- BFAIL  
ERH.f19_f19.F.jaguar PASS --- BFAIL  
ERS.f19_f19.F1850.jaguar PASS --- BFAIL  
ERS.T62_t12.G.jaguar FAIL --- BFAIL shf* and sfwf* forcing files not available
ERS.f05_t12.B.jaguar FAIL --- BFAIL core dump during initialization run
SMS.ne30_f19_g16.F.jaguar PASS --- BFAIL  
PET_PT.T62_g16.C.jaguar PASS --- BFAIL  
PET_PT.T62_g16.D.jaguar PASS --- BFAIL  
PET_PT.T62_g16.G.jaguar PASS --- BFAIL  
PET_PT.f19_f19.F.jaguar PASS --- BFAIL  
PET_PT.f19_g16.I.jaguar PASS --- BFAIL  
PET_PT.f19_g16.E.jaguar PASS --- BFAIL  
PET_PT.f19_g16.B1850CN.jaguar PASS --- BFAIL  



Franklin PostTest Record


Possible test result outcomes:
  UNDEF - undefined result
  SFAIL - scripts case generation failed
  TFAIL - test setup error
  GEN   - case generated
  PEND  - case submitted
  RUN   - case running or died during run, likely failure
  PASS  - case passed
  CHECK - manual review of data is required
  FAIL  - case failed
  BFAIL - compare test couldn't find base result
  ERROR - test checker failed, test may or may not have passed

TestStatusCompare Baseline HistoryCompare Baseline LogsNotes
SMS_D.f09_g16.B20TRCN.franklin PASS PASS PASS  
ERS.f09_g16.B1850CN.franklin PASS PASS PASS  
ERS.f09_g16.B20TRCN.franklin FAIL --- BFAIL [0] MPICH has run out of unexpected buffer space. Fixed in next release.
ERS.f19_g16.B20TRCNCHM.franklin FAIL --- BFAIL [0] MPICH has run out of unexpected buffer space. Fixed in next release.
ERS.f09_g16.B1850CNCHM.franklin.GC.rel05posttag SFAIL --- --- CAM build-namelist - ERROR: invalid value of use_case (1850_cam4_super_fast_llnl). Fixed in next tag
ERS.f19_g16.X.franklin PASS PASS PASS  
ERS.f45_g37.A.franklin PASS PASS PASS  
ERT.T62_g16.G.franklin PASS PASS PASS  
ERB.T31_g37.I.franklin PASS --- PASS  
ERH.f19_f19.F.franklin PASS --- PASS  
ERS.f05_t12.B.franklin FAIL --- BFAIL dies during initialization run, at time step 0, no core dump


CHECK ERT.T62_g16.G.franklin.perf npes=128 tput=13.240 memh=1919.977 memr=2108.644 tag=ccsm4_0_beta45 baseline 
CHECK ERT.T62_g16.G.franklin.perf npes=128 tput=12.954 memh=1937.734 memr=2123.537 tag=ccsm4_0_rel05 
  

Kraken PostTest Record


Possible test result outcomes:
  UNDEF - undefined result
  SFAIL - scripts case generation failed
  TFAIL - test setup error
  GEN   - case generated
  PEND  - case submitted
  RUN   - case running or died during run, likely failure
  PASS  - case passed
  CHECK - manual review of data is required
  FAIL  - case failed
  BFAIL - compare test couldn't find base result
  ERROR - test checker failed, test may or may not have passed

TestStatusCompare Baseline HistoryCompare Baseline LogsNotes
SMS_D.f09_g16.B20TRCN.kraken PASS PASS PASS  
ERS.f09_g16.B1850CN.kraken PASS PASS PASS  
ERS.f09_g16.B20TRCN.kraken PASS PASS PASS  
ERS.f19_g16.X.kraken PASS PASS PASS  
ERS.f45_g37.A.kraken PASS PASS PASS  
ERT.T62_g16.G.kraken PASS PASS PASS  
ERB.T31_g37.I.kraken PASS --- PASS  
ERH.f19_f19.F.kraken PASS --- PASS  
ERS.f05_t12.B.kraken.GC.rel05posttag RUN --- --- core dumbs during initialization run


CHECK ERT.T62_g16.G.kraken.perf npes=128 tput=13.505 memh=803.836 memr=1012.620 tag=ccsm4_0_beta45 baseline 
CHECK ERT.T62_g16.G.kraken.perf npes=128 tput=13.764 memh=804.248 memr=1010.143 tag=ccsm4_0_rel05 
  

Edinburgh Pretag Test Record


Possible test result outcomes:
  UNDEF - undefined result
  SFAIL - scripts case generation failed
  TFAIL - test setup error
  GEN   - case generated
  PEND  - case submitted
  RUN   - case running or died during run, likely failure
  PASS  - case passed
  CHECK - manual review of data is required
  FAIL  - case failed
  BFAIL - compare test couldn't find base result
  ERROR - test checker failed, test may or may not have passed

TestStatusCompare Baseline HistoryCompare Baseline LogsNotes
ERS.T31_g37.B1850CN.edinburgh_pgi PASS FAIL FAIL expected pop is not bfb for gx3v7
ERS.f45_g37.A.edinburgh_pgi PASS PASS PASS  
ERS.T31_g37.B1850CN.edinburgh_lahey FAIL --- BFAIL expected, lahey doesn't compile pop
ERS.f45_g37.A.edinburgh_lahey PASS PASS PASS  
ERS.f45_g37.B1850CN.edinburgh_intel PASS FAIL FAIL expected pop is not bfb for gx3v7
ERS.f45_g37.A.edinburgh_intel PASS PASS PASS  



Edinburgh Posttag Test Record


Possible test result outcomes:
  UNDEF - undefined result
  SFAIL - scripts case generation failed
  TFAIL - test setup error
  GEN   - case generated
  PEND  - case submitted
  RUN   - case running or died during run, likely failure
  PASS  - case passed
  CHECK - manual review of data is required
  FAIL  - case failed
  BFAIL - compare test couldn't find base result
  ERROR - test checker failed, test may or may not have passed

TestStatusCompare Baseline HistoryCompare Baseline LogsNotes
SMS_D.f19_g16.B20TRCN.edinburgh_pgi PASS --- BFAIL  
ERS.f19_g16.B1850CN.edinburgh_pgi FAIL --- BFAIL p15_31392: p4_error: interrupt SIGx: 15
ERS.f19_g16.X.edinburgh_pgi.GC.rel05posttag PEND --- ---  
ERT.T62_g16.G.edinburgh_pgi FAIL --- BFAIL p7_7442: p4_error: interrupt SIGx: 15
ERB.T31_g37.I.edinburgh_pgi PASS --- PASS  
ERH.f19_f19.F.edinburgh_pgi PASS --- PASS  
SMS_D.f19_g16.B20TRCN.edinburgh_lahey FAIL --- BFAIL expected: lahey failes to compile pop2
ERS.f19_g16.B1850CN.edinburgh_lahey FAIL --- BFAIL expected: lahey failes to compile pop2
ERS.f19_g16.X.edinburgh_lahey PASS PASS PASS  
ERT.T62_g16.G.edinburgh_lahey FAIL --- BFAIL expected: lahey failes to compile pop2
ERB.T31_g37.I.edinburgh_lahey PASS --- PASS  
ERH.f19_f19.F.edinburgh_lahey PASS --- PASS  
SMS_D.f19_g16.B20TRCN.edinburgh_intel.GC.rel05posttag GEN --- ---  
ERS.T31_g37.B1850CN.edinburgh_intel.GC.rel05posttag GEN --- ---  
ERS.f19_g16.X.edinburgh_intel.GC.rel05posttag GEN --- ---  
ERT.T62_g37.G.edinburgh_intel.GC.rel05posttag GEN --- ---  
ERB.T31_g37.I.edinburgh_intel.GC.rel05posttag GEN --- ---  
ERH.f19_f19.F.edinburgh_intel.GC.rel05posttag GEN --- ---  


CHECK ERT.T62_g16.G.edinburgh_pgi.perf npes=16 tput= memh= memr= tag=ccsm4_0_rel05 
 
  
Return to Top

Known Problems

  

_____________________________________________________________________________________________

Description: 
Date       : 
Contact    : 
Information: 

			       
_____________________________________________________________________________________________

Return to Top